Fwd: autobuild[master] failure on sn-devel-144 for task samba during test

classic Classic list List threaded Threaded
1 message Options
Reply | Threaded
Open this post in threaded view
|

Fwd: autobuild[master] failure on sn-devel-144 for task samba during test

Samba - samba-technical mailing list
Hi,

the current autobuild tree for 4.8.0 failed 3 times with the following
error.

https://git.samba.org/?p=metze/samba-autobuild/.git;a=summary
https://git.samba.org/?p=metze/samba-autobuild/.git;a=shortlog;h=86b37c211999cdf49329c7befea8350d1ba3d362

I've now added flapping patches from Douglas for wbinfo whoami and rfc2307.

Any ideas?

Thanks!
metze

-------- Weitergeleitete Nachricht --------
Betreff: autobuild[master] failure on sn-devel-144 for task samba during
test
Datum: Fri, 12 Jan 2018 07:03:17 +0100
Von: [hidden email]
An: [hidden email]


Dear Developer,

Your autobuild on sn-devel-144 failed after 258.2 minutes
when trying to test samba with the following error:

   samba: [test] failed 'make test FAIL_IMMEDIATELY=1' with status 2

the autobuild has been abandoned. Please fix the error and resubmit.

A summary of the autobuild process is here:

  https://git.samba.org/metze/samba-autobuild/autobuild.log

You can see logs of the failed task here:

  https://git.samba.org/metze/samba-autobuild/samba.stdout
  https://git.samba.org/metze/samba-autobuild/samba.stderr

or you can get full logs of all tasks in this job here:

  https://git.samba.org/metze/samba-autobuild/logs.tar.gz

The top commit for the tree that was built was:

commit 86b37c211999cdf49329c7befea8350d1ba3d362
Author: Karolin Seeger <[hidden email]>
Date:   Thu Jan 11 11:11:56 2018 +0100

    VERSION: Bump version up to 4.9.0pre1...
        and re-enable GIT_SNAPSHOT.
        Signed-off-by: Karolin Seeger <[hidden email]>
    Reviewed-by: Stefan Metzmacher <[hidden email]>



The last 50 lines of log messages:

[2205(17509)/2230 at 3h48m41s] samba4.krb5.kdc with machine
account(ad_dc:local)
[2206(17775)/2230 at 3h49m59s] samba4.krb5.kdc with machine
account(fl2000dc:local)
[2207(18041)/2230 at 3h50m16s] samba4.krb5.kdc with machine
account(fl2008r2dc:local)
[2208(18307)/2230 at 3h51m33s] samba.tests.kcc(vampire_dc)
[2209(18309)/2230 at 3h51m34s] samba.tests.kcc(promoted_dc)
[2210(18311)/2230 at 3h51m35s]
samba.tests.netlogonsvc.python(simpleserver)(simpleserver)
[2211(18312)/2230 at 3h51m36s]
samba.tests.netlogonsvc.python(fileserver)(fileserver)
[2212(18313)/2230 at 3h51m36s]
samba.tests.netlogonsvc.python(nt4_dc)(nt4_dc)
[2213(18314)/2230 at 3h51m36s] samba.tests.netlogonsvc.python(ad_dc)(ad_dc)
[2214(18315)/2230 at 3h51m36s]
samba.tests.netlogonsvc.python(ad_dc_ntvfs)(ad_dc_ntvfs)
[2215(18316)/2230 at 3h51m37s]
samba.tests.netlogonsvc.python(ad_member)(ad_member)
[2216(18317)/2230 at 3h51m38s] samba.tests.ntlmdisabled.python(ktest)(ktest)
[2217(18319)/2230 at 3h51m38s]
samba.tests.ntlmdisabled.python(ad_member)(ad_member)
[2218(18321)/2230 at 3h51m38s]
samba.tests.ntlmdisabled.python(ad_dc_no_ntlm)(ad_dc_no_ntlm)
[2219(18323)/2230 at 3h53m10s]
samba4.blackbox.samba_tool_demote(vampire_dc)(vampire_dc)
[2220(18324)/2230 at 3h53m12s]
samba4.blackbox.samba_tool_demote(promoted_dc)(promoted_dc)
[2221(18325)/2230 at 3h53m14s] samba4.blackbox.samba_tool_demote(rodc)(rodc)
[2222(18326)/2230 at 3h53m15s]
samba4.blackbox.dbcheck(ad_dc_ntvfs)(ad_dc_ntvfs:local)
[2223(18330)/2230 at 3h54m34s] samba4.blackbox.dbcheck(ad_dc)(ad_dc:local)
[2224(18334)/2230 at 3h54m55s]
samba4.blackbox.dbcheck(fl2000dc)(fl2000dc:local)
[2225(18338)/2230 at 3h55m13s]
samba4.blackbox.dbcheck(fl2003dc)(fl2003dc:local)
[2226(18342)/2230 at 3h55m32s]
samba4.blackbox.dbcheck(fl2008r2dc)(fl2008r2dc:local)
[2227(18346)/2230 at 3h55m52s]
samba4.blackbox.dbcheck(vampire_dc)(vampire_dc:local)
[2228(18350)/2230 at 3h57m9s]
samba4.blackbox.dbcheck(promoted_dc)(promoted_dc:local)
UNEXPECTED(failure):
samba4.blackbox.dbcheck(promoted_dc).dbcheck(promoted_dc:local)
REASON: Exception: Exception: Checking 18400 objects
NOTE: old (due to rename or delete) DN string component for
defaultObjectCategory in object
CN=DrsReplSchema-1515731444-1-cls-B-NEW,CN=Schema,CN=Configuration,DC=samba,DC=example,DC=com
-
<GUID=b426dadb-7de3-4460-9914-4702a6d0a275>;CN=DrsReplSchema-1515731444-1-cls-B,CN=Schema,CN=Configuration,DC=samba,DC=example,DC=com
Not fixing old string component
NOTE: old (due to rename or delete) DN string component for
defaultObjectCategory in object
CN=schemaInfo-Class-1515726777-NEW,CN=Schema,CN=Configuration,DC=samba,DC=example,DC=com
-
<GUID=d298c84d-2e81-428e-a28f-f89015674e2b>;CN=schemaInfo-Class-1515726777,CN=Schema,CN=Configuration,DC=samba,DC=example,DC=com
Not fixing old string component
NOTE: old (due to rename or delete) DN string component for
defaultObjectCategory in object
CN=DrsReplSchema-1515731496-1-cls-B-NEW,CN=Schema,CN=Configuration,DC=samba,DC=example,DC=com
-
<GUID=4c65e755-e084-4148-b5c5-fb84a59dee7d>;CN=DrsReplSchema-1515731496-1-cls-B,CN=Schema,CN=Configuration,DC=samba,DC=example,DC=com
Not fixing old string component
NOTE: old (due to rename or delete) DN string component for
lastKnownParent in object CN=test-specifier1

FAILED (1 failures, 0 errors and 0 unexpected successes in 0 testsuites)

A summary with detailed information can be found in:
  ./bin/ab/summary
TOP 10 slowest tests
samba3.local.nss(ad_dc:local) -> 712
samba4.ldap.vlv.python(ad_dc_ntvfs)(ad_dc_ntvfs) -> 635
samba4.drs.link_conflicts.python(promoted_dc)(promoted_dc) -> 493
samba4.ldap.rodc_rwdc.python(rodc)(rodc:local) -> 411
samba4.drs.link_conflicts.python(vampire_dc)(vampire_dc) -> 342
samba4.drs.ridalloc_exop.python(vampire_dc)(vampire_dc) -> 285
samba4.drs.replica_sync.python(promoted_dc)(promoted_dc:local) -> 247
samba4.drs.repl_move.python(vampire_dc)(vampire_dc) -> 233
samba4.rpc.samr.passwords.lockout on ncacn_np with (ad_dc_ntvfs) -> 224
samba4.rpc.samr.passwords.pwdlastset on ncacn_np with (ad_dc_ntvfs) -> 200
ERROR: test failed with exit code 1




signature.asc (853 bytes) Download Attachment